﻿Titre de la ressource,Description,Créé le,Publié par,Dernière modification,Modifié par,Intitulé dans l'ordre du culte,Hits,Document type,Version,État,Vote,Favoris, ,Tags,Emplacement dans le lieu,Geste symbolique,Intervenant-s,Durée,Référence biblique,Liens vers ressources,Indications pratiques,Remarques éventuelles,Source / droits,Remarque de l'auteur,Auteur,Je certifie que l’auteur accepte la licence suivante :
"Moi, Bartimée, fils de Timée",,2021-10-26 18:27:05,722,2021-10-27 15:50:09,614,Prédication,,,,,,,,,prédication,--,,,"Marc 10, 46 à 52",,,,,,Gwendoline Noël-Reguin,CulteBox
Lettre à Thomas,,2019-04-12 08:46:50,674,2019-04-12 10:10:48,605,Prédication,,,,,,,,,,,,,"Jean 20, 24 à 29",,,,,,Anne-Marie Droz,CulteBox
Quel titre ?,,2017-07-18 08:52:30,617,2017-07-18 08:52:30,0,Prédication - titre manque !,,,,,,,,,,,,,,,,,,,,
Comment prier,,2017-06-12 14:36:58,617,2017-06-12 14:36:58,0,Comment prier,,,,,,,,,,,,,,,,,,,D’après B. Bolay,
Vivre de l’amour de Dieu,,2017-06-08 08:20:00,617,2017-06-08 08:20:00,0,Vivre de l’amour de Dieu,,,,,,,,,,,,,,,,,,,D’après B. Bolay,
Tout est dit,,2017-04-19 09:40:20,617,2017-04-19 09:40:20,0,Tout est dit,,,,,,,,,,,,,,,,,,,D'après O. Favrod,
Tout est dit,,2017-04-19 09:40:06,617,2017-04-19 09:40:06,0,Tout est dit,,,,,,,,,,,,,,,,,,,D'après O. Favrod,
La question,,2017-04-19 09:27:30,617,2017-05-03 13:39:32,605,Prédication,,,,,,,,,,,,,,,,,,,D'après B. Bolay,
Quelle liberté donc que la vôtre ! (Réfugiés),,2017-04-19 07:41:44,617,2017-04-19 07:41:44,0,Quelle liberté donc que la vôtre ! (Réfugiés),,,,,,,,,,,,,,,,,,,D'après B. Bolay,
Créé et responsable,,2017-04-19 07:19:41,617,2017-04-19 07:19:41,0,Créé et responsable,,,,,,,,,,,,,,,,,,,,
