﻿Titre de la ressource,Description,Créé le,Publié par,Dernière modification,Modifié par,Intitulé dans l'ordre du culte,Hits,Document type,Version,État,Vote,Favoris, ,Tags,Emplacement dans le lieu,Geste symbolique,Intervenant-s,Durée,Référence biblique,Liens vers ressources,Indications pratiques,Remarques éventuelles,Source / droits,Remarque de l'auteur,Auteur,Je certifie que l’auteur accepte la licence suivante :
Invocation - Campagne de Carême,,2022-03-05 14:27:21,722,2022-03-05 16:39:46,614,Invocation,,,,,,,,,,,,,,,,,,,Gwendoline Noël-Reguin,CulteBox
Bénédiction,,2020-04-15 05:59:44,608,2020-04-17 15:39:14,614,Bénédiction,,,,,,,,,,,,,"Gn 18,1-15",,,,,,Nicolas Lüthi,Domaine public
Le jeûne comme une prière,,2020-04-15 05:39:54,608,2020-04-17 15:39:39,614,Le jeûne comme une prière,,,,,,,,,,,,,,,,,,,Nicolas Lüthi,CulteBox
Intercession Coronavirus 2020,,2020-03-31 09:43:35,764,2020-03-31 12:11:36,614,Intercession,,,,,,,,,,,,,,,,,,,Christophe Reymond,CulteBox
C'est carême,,2019-07-31 16:36:37,608,2019-08-06 07:12:05,614,C'est carême... veux-tu jeûner?,,,,,,,,,,,,,,,,,,,Inconnu,Je ne sais pas
Epiclèse,,2018-10-19 12:46:38,605,2018-10-19 12:47:10,605,Epiclèse,,,,,,,,,,,,,,,,,,,d'après B. Bolay,
"Une seule famille,",,2017-04-05 13:45:51,617,2018-07-25 07:42:48,605,Ouverture,,,,,,,,,,,,,,,,,,,D'après B. Bolay,
Montagne et taupinière,,2017-04-05 13:39:20,617,2017-08-16 09:37:19,605,Acte de repentance,,,,,,,,,Lutrin,,Officiant,Variable,,,,,,,D'après B. Bolay,
,,2017-03-21 10:56:42,605,2018-07-25 07:23:44,605,Quelle est la volonté de Dieu pour moi ?,,,,,,,,,,,,1 heure,"Ac 21, 1-17",,,,,,D'après Bernard Bolay,
